{
  "id": "82d49b37-e10b-4148-8b8a-60620ba3d1a5",
  "project": "aris-mc",
  "number": 39,
  "commit": "cfdbc7bdd1b144dfb31fdb05f18dc122eb4eb36c",
  "previous_commit": "547369be6660651f12095b07576b96606d33011a",
  "docs_commit": null,
  "state": "failed",
  "started_at": "2026-09-20T05:51:59.198045596Z",
  "finished_at": "2026-09-20T05:53:00.709868760Z",
  "current_step": null,
  "log": "$ git config core.sharedRepository group\n$ git remote set-url origin git@github.com:dayo05/aris-mc.git\n$ git fetch --prune --force origin\nFrom github.com:dayo05/aris-mc\n   547369b..cfdbc7b  master     -> origin/master\n$ git checkout -B master origin/master\nbranch 'master' set up to track 'origin/master'.\nYour branch is up to date with 'origin/master'.\nReset branch 'master'\n$ git reset --hard origin/master\nHEAD is now at cfdbc7b Add scripted item attributes and creative tabs\n$ git clean -fdx\nRemoving .gradle/\nRemoving .kotlin/\nRemoving build/\nRemoving common/.gradle/\nRemoving common/build/\nRemoving fabric/.gradle/\nRemoving fabric/build/\nRemoving neoforge/.gradle/\nRemoving neoforge/build/\n$ git submodule sync --recursive\n$ git submodule update --init --recursive --force\n$ git rev-parse HEAD\ncfdbc7bdd1b144dfb31fdb05f18dc122eb4eb36c\n\n[git] HEAD=cfdbc7bdd1b144dfb31fdb05f18dc122eb4eb36c\n\n[config] using workspace/kei.toml\n\n=== step: build ===\n$ sudo -n -E -H -u kei-aris-mc -- ./gradlew build\nStarting a Gradle Daemon (subsequent builds will be faster)\n\n> Configure project :\nArchitect Plugin: 3.4.164\nArchitectury Loom: 1.13.469\nThis version of Architectury Loom is in beta! Please report any issues you encounter: https://github.com/architectury/architectury-loom/issues\n\n> Configure project :fabric\n:remapped 50 mods (intermediary -> named) in 1s\n:remapping sources (Mercury, intermediary -> named)\n\n> Configure project :neoforge\n:found 1 forge source jars\n:extracted 956 forge source classes\n\n> Task :checkKotlinGradlePluginConfigurationErrors SKIPPED\n> Task :compileKotlin NO-SOURCE\n> Task :compileJava NO-SOURCE\n> Task :processResources NO-SOURCE\n> Task :classes UP-TO-DATE\n> Task :jar\n> Task :sourcesJar\n> Task :assemble\n> Task :compileTestKotlin NO-SOURCE\n> Task :compileTestJava NO-SOURCE\n> Task :processTestResources NO-SOURCE\n> Task :testClasses UP-TO-DATE\n> Task :test NO-SOURCE\n> Task :check UP-TO-DATE\n> Task :build\n> Task :common:checkKotlinGradlePluginConfigurationErrors SKIPPED\n> Task :common:exportClasspath\n> Task :common:processIncludeJars\n> Task :common:validateAccessWidener\n> Task :fabric:checkKotlinGradlePluginConfigurationErrors SKIPPED\n> Task :fabric:exportClasspath\n> Task :fabric:processResources\n> Task :fabric:processIncludeJars\n> Task :fabric:processTestResources NO-SOURCE\n> Task :fabric:validateAccessWidener\n> Task :neoforge:checkKotlinGradlePluginConfigurationErrors SKIPPED\n> Task :neoforge:exportClasspath\n> Task :neoforge:processResources\n> Task :neoforge:processIncludeJars\n> Task :neoforge:processTestResources NO-SOURCE\n> Task :neoforge:validateAccessWidener\n\n> Task :common:kspKotlin FAILED\ne: [ksp] java.nio.file.AccessDeniedException: /var/lib/kei/workspaces/aris-mc/apis/i18n/en.json\n\n[Incubating] Problems report is available at: file:///var/lib/kei/workspaces/aris-mc/build/reports/problems/problems-report.html\n\nFAILURE: Build failed with an exception.\n\n* What went wrong:\nExecution failed for task ':common:kspKotlin'.\n> A failure occurred while executing com.google.devtools.ksp.gradle.KspAAWorkerAction\n   > /var/lib/kei/workspaces/aris-mc/apis/i18n/en.json\n\n* Try:\n> Run with --stacktrace option to get the stack trace.\n> Run with --info or --debug option to get more log output.\n> Run with --scan to get full insights.\n> Get more help at https://help.gradle.org.\n\nDeprecated Gradle features were used in this build, making it incompatible with Gradle 9.0.\n\nYou can use '--warning-mode all' to show the individual deprecation warnings and determine if they come from your own scripts or plugins.\n\nFor more on this, please refer to https://docs.gradle.org/8.12.1/userguide/command_line_interface.html#sec:command_line_warnings in the Gradle documentation.\n\nBUILD FAILED in 57s\n14 actionable tasks: 14 executed\n\n[error] step 'build' failed (exit Some(1))\n",
  "artifacts": [],
  "error": "step 'build' failed (exit Some(1))"
}